{"text_format":"1","workbook":"xlsx","n_sheets":11,"sheets":["Général","1. Frais de personnel","2-3.Frais de voyage-séjour","4. Equipement","5. Sous-traitance","B. Mobilité Spécial - Etudiant","B. Mobilité Spécial - Personnel","Cofinancement","Ventilation&Financement Projet","Rates","Coûts Unitaires & RèglesFinance"],"not_rendered":{"charts":0,"images":2,"macros":1,"external_links":0,"defined_names":51,"comments":0,"pivot_tables":0},"unopened":[],"bounds":{"document_bytes":16777216,"sheet_cells":100000,"rows_first":2000,"rows_last":500,"rows_between":2000,"halvings":0,"cell_chars":16384,"cell_head_chars":4096},"cells_cut":0,"cells_raw":0,"read":"whole","date_system":"1900"}

{"sheet":"Général","index":0,"n_rows":87,"n_cols":12,"rows_kept":87,"cut":false,"hidden":false,"merged":[[23,8,26,8],[23,10,26,10],[26,6,26,7],[25,6,25,7],[24,6,24,7],[23,6,23,7],[16,4,16,11],[6,1,6,11],[7,1,7,11],[8,1,8,11],[10,1,10,2],[11,1,11,2],[12,1,12,2],[15,1,15,11],[16,1,16,2],[12,4,12,11],[11,4,11,11],[10,4,10,11],[13,1,13,2],[13,3,13,11],[30,1,30,11],[17,1,17,2],[18,1,18,2],[19,1,19,2],[20,1,20,2],[28,1,28,2],[21,1,21,2],[21,4,21,11],[28,4,28,11],[20,4,20,11],[19,4,19,11],[18,4,18,11],[17,4,17,11],[23,1,26,2],[23,3,26,3],[23,4,26,5]]}
[]
[]
[null,null,null,"Action clé n° 2:  coopération en faveur de l’innovation et de l’échange des bonnes pratiques"]
[null,null,null,"Renforcement des capacités dans le domaine de l’enseignement supérieur"]
[]
[]
[null,"Avant de compléter ce tableau, veuillez lire attentivement les instructions disponibles sur"]
[null,"APPEL A PROPOSITIONS 2017 – EAC/A03/2016 - Programme Erasmus+ (C2016/386/09)"]
[null,"Guide du programme et instructions pour les candidats"]
[]
{"$rows_left_out":78}
{"sheet":"1. Frais de personnel","index":1,"n_rows":14,"n_cols":20,"rows_kept":14,"cut":false,"hidden":false,"merged":[[4,1,4,2],[3,1,3,2],[8,1,8,2],[2,1,2,18],[10,17,11,17],[10,19,11,19],[1,1,1,19],[10,18,11,18],[10,5,10,7],[10,8,10,10],[10,11,10,13],[10,14,10,16],[9,1,9,18],[3,6,8,19],[10,1,11,1],[10,4,11,4],[10,3,11,3],[10,2,11,2],[7,1,7,2],[6,1,6,2],[5,1,5,2]]}
[]
[null,"1. Frais de personnel"]
[]
[null,null,null,"Total (EUR)","Nombre de jours"]
[null,"Gestionnaire",null,{"$f":"SUM(H:H)","v":0},{"$f":"SUMIF(T:T,\"<>Erreur\",F:F)","v":0}]
[null,"Enseignant/formateur/chercheur",null,{"$f":"SUM(K:K)","v":0},{"$f":"SUMIF(T:T,\"<>Erreur\",I:I)","v":0}]
[null,"Personnel technique",null,{"$f":"SUM(N:N)","v":0},{"$f":"SUMIF(T:T,\"<>Erreur\",L:L)","v":0}]
[null,"Personnel administratif",null,{"$f":"SUM(Q:Q)","v":0},{"$f":"SUMIF(T:T,\"<>Erreur\",O:O)","v":0}]
[null,null,null,{"$f":"SUM(D5:D8)","v":0},{"$f":"SUM(E5:E8)","v":0}]
[]
{"$rows_left_out":5}
{"sheet":"2-3.Frais de voyage-séjour","index":2,"n_rows":14,"n_cols":15,"rows_kept":14,"cut":false,"hidden":false,"merged":[[10,14,11,14],[1,1,1,14],[10,5,11,5],[10,8,11,8],[10,7,11,7],[10,6,11,6],[10,4,11,4],[10,3,11,3],[10,13,11,13],[10,12,11,12],[10,11,11,11],[10,10,11,10],[10,9,11,9],[7,5,8,5],[5,5,6,5],[3,5,4,5],[7,4,8,4],[5,4,6,4],[3,4,4,4],[10,1,11,1],[10,2,11,2],[8,1,8,2],[7,1,7,2],[6,1,6,2],[5,1,5,2],[4,1,4,2],[3,1,3,2]]}
[]
[null,"2-3.Frais de voyage-séjour"]
[]
[null,"Frais de voyage Etudiant (EUR)",null,{"$f":"SUMIF(G:G,\"Etudiant\",L:L)","v":0},{"$f":"D4+D5","v":0},{"$f":"SUMIFS(H:H,G:G,\"Etudiant\",O:O,\"<>Erreur\")","v":0}]
[null,"Frais de séjour Etudiant (EUR)",null,{"$f":"SUMIF(G:G,\"Etudiant\",M:M)","v":0}]
[null,"Frais de voyage Personnel (EUR)",null,{"$f":"SUMIF(G:G,\"Personnel\",L:L)","v":0},{"$f":"D6+D7","v":0},{"$f":"SUMIFS(H:H,G:G,\"Personnel\",O:O,\"<>Erreur\")","v":0}]
[null,"Frais de séjour Personnel (EUR)",null,{"$f":"SUMIF(G:G,\"Personnel\",M:M)","v":0}]
[null,"Total Frais de voyage (EUR)",null,{"$f":"SUM(L:L)","v":0},{"$f":"D8+D9","v":0},{"$f":"F4+F6","v":0}]
[null,"Total Frais de séjour (EUR)",null,{"$f":"SUM(M:M)","v":0}]
[]
{"$rows_left_out":5}
{"sheet":"4. Equipement","index":3,"n_rows":14,"n_cols":9,"rows_kept":14,"cut":false,"hidden":false,"merged":[[10,8,11,8],[1,1,1,8],[10,7,11,7],[10,6,11,6],[10,5,11,5],[10,4,11,4],[3,1,8,1],[3,2,8,3],[10,3,11,3],[10,1,11,1],[10,2,11,2]]}
[]
[null,"4. Equipement"]
[]
[null,"Total (EUR)",{"$f":"SUM(H:H)","v":0}]
[]
[]
[]
[]
[]
[]
{"$rows_left_out":5}
{"sheet":"5. Sous-traitance","index":4,"n_rows":14,"n_cols":9,"rows_kept":14,"cut":false,"hidden":false,"merged":[[10,8,11,8],[1,1,1,8],[10,7,11,7],[3,1,8,1],[3,2,8,3],[10,1,11,1],[10,2,11,2],[10,3,11,3],[10,4,11,4],[10,5,11,5],[10,6,11,6]]}
[]
[null,"5. Sous-traitance"]
[]
[null,"Total (EUR)",{"$f":"SUM(H:H)","v":0}]
[]
[]
[]
[]
[]
[]
{"$rows_left_out":5}
{"sheet":"B. Mobilité Spécial - Etudiant","index":5,"n_rows":14,"n_cols":18,"rows_kept":14,"cut":false,"hidden":false,"merged":[[10,1,11,1],[10,2,11,2],[10,3,11,3],[10,4,11,4],[10,6,11,6],[10,14,11,14],[1,1,1,14],[10,10,11,10],[10,11,11,11],[10,12,11,12],[10,13,11,13],[10,8,11,8],[10,9,11,9],[3,1,4,1],[3,2,4,2],[5,1,6,1],[5,2,6,2],[7,1,8,1],[7,2,8,2],[10,5,11,5],[10,7,11,7]]}
[]
[null,"B. Mobilité Spécial - Etudiant"]
[]
[null,"Frais de voyage",{"$f":"SUM(L:L)","v":0}]
[]
[null,"Frais de séjour",{"$f":"SUM(M:M)","v":0}]
[]
[null,"Total (EUR)",{"$f":"C4+C6","v":0}]
[]
[]
{"$rows_left_out":5}
{"sheet":"B. Mobilité Spécial - Personnel","index":6,"n_rows":14,"n_cols":18,"rows_kept":14,"cut":false,"hidden":false,"merged":[[10,3,11,3],[3,1,4,1],[3,2,4,2],[5,1,6,1],[5,2,6,2],[10,14,11,14],[1,1,1,14],[10,4,11,4],[10,5,11,5],[10,13,11,13],[10,7,11,7],[10,8,11,8],[10,9,11,9],[10,10,11,10],[10,11,11,11],[10,12,11,12],[10,6,11,6],[7,1,8,1],[7,2,8,2],[10,1,11,1],[10,2,11,2]]}
[]
[null,"B. Mobilité Spécial - Personnel"]
[]
[null,"Frais de voyage",{"$f":"SUM(L:L)","v":0}]
[]
[null,"Frais de séjour",{"$f":"SUM(M:M)","v":0}]
[]
[null,"Total (EUR)",{"$f":"C4+C6","v":0}]
[]
[]
{"$rows_left_out":5}
{"sheet":"Cofinancement","index":7,"n_rows":18,"n_cols":10,"rows_kept":18,"cut":false,"hidden":false,"merged":[[10,9,11,9],[1,1,1,9],[10,8,11,8],[10,5,11,5],[3,2,8,2],[3,1,8,1],[10,1,11,1],[10,2,11,2],[10,3,11,3],[10,6,11,6],[10,7,11,7],[10,4,11,4]]}
[]
[null,"Information sur le Cofinancement"]
[]
[null,"Total (EUR)",{"$f":"SUM(I:I)","v":0}]
[]
[]
[]
[]
[]
[]
{"$rows_left_out":9}
{"sheet":"Ventilation&Financement Projet","index":8,"n_rows":81,"n_cols":9,"rows_kept":81,"cut":false,"hidden":false,"merged":[[1,1,1,8],[13,1,13,8],[4,7,8,7],[22,1,22,8]]}
[]
[null,"Ventilation par Lot / Poste Budgétaire"]
[]
[null,"Lots","1. Frais de personnel","2. Frais de \nvoyage","3. Frais de \nséjour","4. Equipement","5. Sous-traitance","B. Mobilité(s)\nSpéciale(s)","Total\n(EUR)"]
[null,{"$f":"Rates!P14","v":"Préparation"},{"$f":"SUMIF('1. Frais de personnel'!B:B,B5,'1. Frais de personnel'!S:S)","v":0},{"$f":"SUMIF('2-3.Frais de voyage-séjour'!B:B,B5,'2-3.Frais de voyage-séjour'!L:L)","v":0},{"$f":"SUMIF('2-3.Frais de voyage-séjour'!B:B,B5,'2-3.Frais de voyage-séjour'!M:M)","v":0},{"$f":"SUMIF('4. Equipement'!B:B,B5,'4. Equipement'!H:H)","v":0},{"$f":"SUMIF('5. Sous-traitance'!B:B,B5,'5. Sous-traitance'!H:H)","v":0},null,{"$f":"SUM(C5:G5)","v":0}]
[null,{"$f":"Rates!P15","v":"Développement"},{"$f":"SUMIF('1. Frais de personnel'!B:B,B6,'1. Frais de personnel'!S:S)","v":0},{"$f":"SUMIF('2-3.Frais de voyage-séjour'!B:B,B6,'2-3.Frais de voyage-séjour'!L:L)","v":0},{"$f":"SUMIF('2-3.Frais de voyage-séjour'!B:B,B6,'2-3.Frais de voyage-séjour'!M:M)","v":0},{"$f":"SUMIF('4. Equipement'!B:B,B6,'4. Equipement'!H:H)","v":0},{"$f":"SUMIF('5. Sous-traitance'!B:B,B6,'5. Sous-traitance'!H:H)","v":0},null,{"$f":"SUM(C6:G6)","v":0}]
[null,{"$f":"Rates!P16","v":"Plan Qualité"},{"$f":"SUMIF('1. Frais de personnel'!B:B,B7,'1. Frais de personnel'!S:S)","v":0},{"$f":"SUMIF('2-3.Frais de voyage-séjour'!B:B,B7,'2-3.Frais de voyage-séjour'!L:L)","v":0},{"$f":"SUMIF('2-3.Frais de voyage-séjour'!B:B,B7,'2-3.Frais de voyage-séjour'!M:M)","v":0},{"$f":"SUMIF('4. Equipement'!B:B,B7,'4. Equipement'!H:H)","v":0},{"$f":"SUMIF('5. Sous-traitance'!B:B,B7,'5. Sous-traitance'!H:H)","v":0},null,0]
[null,{"$f":"Rates!P17","v":"Diffusion et Exploitation des Résultats"},{"$f":"SUMIF('1. Frais de personnel'!B:B,B8,'1. Frais de personnel'!S:S)","v":0},{"$f":"SUMIF('2-3.Frais de voyage-séjour'!B:B,B8,'2-3.Frais de voyage-séjour'!L:L)","v":0},{"$f":"SUMIF('2-3.Frais de voyage-séjour'!B:B,B8,'2-3.Frais de voyage-séjour'!M:M)","v":0},{"$f":"SUMIF('4. Equipement'!B:B,B8,'4. Equipement'!H:H)","v":0},{"$f":"SUMIF('5. Sous-traitance'!B:B,B8,'5. Sous-traitance'!H:H)","v":0},null,0]
[null,{"$f":"Rates!P18","v":"Gestion"},{"$f":"SUMIF('1. Frais de personnel'!B:B,B9,'1. Frais de personnel'!S:S)","v":0},{"$f":"SUMIF('2-3.Frais de voyage-séjour'!B:B,B9,'2-3.Frais de voyage-séjour'!L:L)","v":0},{"$f":"SUMIF('2-3.Frais de voyage-séjour'!B:B,B9,'2-3.Frais de voyage-séjour'!M:M)","v":0},{"$f":"SUMIF('4. Equipement'!B:B,B9,'4. Equipement'!H:H)","v":0},{"$f":"SUMIF('5. Sous-traitance'!B:B,B9,'5. Sous-traitance'!H:H)","v":0},null,0]
[null,"Total",{"$f":"SUM(C5:C9)","v":0},0,0,0,{"$f":"SUM(G5:G9)","v":0},{"$f":"'B. Mobilité Spécial - Etudiant'!C8+'B. Mobilité Spécial - Personnel'!C8","v":0},{"$f":"SUM(C10:H10)","v":0}]
{"$rows_left_out":72}
{"sheet":"Rates","index":9,"n_rows":182,"n_cols":17,"rows_kept":182,"cut":false,"hidden":true,"merged":[[1,4,1,7],[1,8,1,11]]}
[]
[null,null,null,null,"Staff Costs",null,null,null,"SMS"]
[null,null,"Country","PR/PA","Gestionnaire","Enseignant/formateur/chercheur","Personnel technique","Personnel administratif","Etudiants des Pays Partenaires","Etudiants des Pays Programmes","Personnel des Pays Partenaires","Personnel des Pays Programmes",null,"Country\nSMS",null,"Distance","Travel \nCosts\n(EUR)"]
[null,1,"Allemagne","Pays Programmes",280,214,162,131,800,0,120,0,null,"Allemagne",null,"0 KM et 9 KM",0]
[null,2,"Ancienne République yougoslave de Macédoine","Pays Programmes",88,74,55,39,750,0,120,0,null,"Ancienne République yougoslave de Macédoine",null,"10 KM et 99 KM",20]
[null,3,"Autriche","Pays Programmes",294,241,190,157,850,0,140,0,null,"Autriche",null,"100 KM et 499 KM",180]
[null,4,"Belgique","Pays Programmes",280,214,162,131,800,0,140,0,null,"Belgique",null,"500 KM et 1999 KM",275]
[null,5,"Bulgarie","Pays Programmes",88,74,55,39,750,0,140,0,null,"Bulgarie",null,"2000 KM et 2999 KM",360]
[null,6,"Chypre","Pays Programmes",164,137,102,78,800,0,140,0,null,"Chypre",null,"3000 KM et 3999 KM",530]
[null,7,"Croatie","Pays Programmes",88,74,55,39,800,0,100,0,null,"Croatie",null,"4000 KM et 7999 KM",820]
{"$rows_left_out":173}
{"sheet":"Coûts Unitaires & RèglesFinance","index":10,"n_rows":186,"n_cols":28,"rows_kept":186,"cut":false,"hidden":false,"merged":[[4,22,4,27],[5,22,5,27],[0,1,0,27],[3,1,3,6],[3,8,3,9],[3,11,3,13],[3,15,3,16],[3,18,3,20],[3,22,3,27],[2,2,2,7],[1,2,1,7],[6,15,6,16],[6,18,6,20],[4,1,5,6],[4,8,5,9],[4,11,5,13],[4,15,5,16],[4,18,5,20]]}
[null,"COÛTS UNITAIRES ET UN RÉSUMÉ DES RÈGLES DE FINANCEMENT POUR LES PROJETS CONJOINTS ET STRUCTURELS DE RENFORCEMENT DES CAPACITÉ DANS LE DOMAINE DE L'ENSEIGNEMENT SUPÉRIEUR\n\nVeuillez trouver ci-dessous les valeurs des coûts unitaires utilisées dans ce fichier pour le calcul de la subvention.\nFaites référence au guide du programmes Erasmus+ 2017* pour un aperçu complet des règles de financement applicables aux projets conjoints et structurels de renforcement des capacité dans le domaine de l'enseignement supérieur (partie B du Guide et Annexe I) "]
[null,"* Lien vers le guide du Programme Erasmus+ 2017: ","http://ec.europa.eu/programmes/erasmus-plus/resources_en"]
[null,"* Lien vers l'appel à propositions, formulaires de candidature, annexes et lignes directrices:","http://eur-lex.europa.eu/legal-content/EN/TXT/?uri=OJ:JOC_2016_386_R_0009"]
[null,"A.1 Frais de Personnel",null,null,null,null,null,null,"A.2 & B Frais de Voyage",null,null,"A. 3 Frais de Séjour",null,null,null,"A.4 Equipement",null,null,"A.5 Sous-traitance",null,null,null,"B - Volet Spécial pour la Mobilité"]
[null,"Les coûts unitaires\n\nContribution aux frais de personnel effectuant des tâches qui sont directement nécessaires à la réalisation des objectifs du projet.\n\nConditionnelles: les candidats devront justifier le type et le volume des ressources nécessaires dans le cadre de la mise en œuvre des activités et des résultats proposées. La contribution est valable à condition que le salaire pour les mêmes tâches est compensée qu'une seule fois.",null,null,null,null,null,null,"Les coûts unitaires sont indiqués sur la base de la distance d'un voyage par participant.\n\nLes distances de voyage doivent être calculés en utilisant le calculateur de distance fourni par la Commission européenne.\n\nLe demandeur doit indiquer la distance d’un trajet aller afin que puisse être calculé le montant de la bourse de l’UE qui servira à financer le voyage aller-retour.",null,null,"Les frais de subsistance, le logement, transports locaux et publics tels que bus et taxi, assurance-santé personnelle ou facultative.\n\n Les coûts unitaires sur la base de la durée du séjour des participants:\n\nPersonnel: \n120 EUR/jour du jour 1 au jour 14\n70 EUR/jour du jour 15 au jour 60\n50 EUR/jour du jour 61 au jour 90 (le maximum)\n\nEtudiant: \n55 EUR/jour du jour 1 au jour 14\n40 EUR/jour du jour 15 au jour 90 (le maximum)",null,null,null,"Contribution pour l'achat de matériel nécessaire à la mise en œuvre du projet. Le soutien est valable uniquement pour le matériel acheté pour les EES dans les pays partenaires.\n\nCondition: la demande subvention pour couvrir ces coûts doit être motivée dans le formulaire de demande.",null,null,"Contribution aux coûts de sous-traitance qui sont nécessaires pour la mise en œuvre du projet, y compris, notamment, les coûts pour les audits financiers obligatoires (certificat d'audit) et pour activités d'assurance de la qualité (externe).\n\nSous-traitance pour les tâches de gestion de projets-ne est pas admissible.\nLa sous-traitance à des organismes externes devrait être très occasionnelle. \n\nLes compétences spécifiques et une expertise particulière nécessaire pour atteindre les objectifs du projet devraient être trouvées dans le consortium et devraient déterminer sa composition.",null,null,null,"Les frais de voyage (étudiants et personnel): Les coûts unitaires (veuillez faire référence à des coûts unitaires dans le tableau A2).\nContribution aux frais de voyage des étudiants et du personnel impliqués dans le \"volet spécial mobilité\", de leur lieu d'origine au lieu de l'activité et retour (y compris les frais de visa et l'assurance obligatoire liée, assurance voyage et frais d'annulation si justifié).\n\nLes activités et voyages connexes doivent être effectuées dans les pays impliqués dans le projet. Toute exception à cette règle doit être autorisée par l'Agence Executive. Pour la liste détaillée des activités admissibles, voir l'annexe I du présent guide.\n\nLes frais de séjour: les coûts unitaires sur la base de la durée du séjour des participants.\nLes frais de subsistance, le logement, transports locaux et publics tels que bus et taxi, assurance-santé personnelle ou facultative -  sur la base de la durée du séjour par participant."]
[null,null,null,null,null,null,null,null,null,null,null,null,null,null,null,null,null,null,null,null,null,null,"Frais de séjour pour le Volet Spécial Mobilité"]
[null,"Pays","PR/PA","Gestionnaire","Enseignant/formateur/chercheur","Personnel \nTechnique","Personnel administratif",null,"Distance","Frais de Voyage\n(EUR)",null,"Nombre de jours","Etudiant","Personnel",null,"100% des coûts éligibles\nMax. 30% de la subvention totale",null,null,"100% des coûts éligibles\nMax. 10% de la subvention totale",null,null,null,"Country","PR/PA","Etudiants des Pays Partenaires","Etudiants des Pays Programmes","Personnel des Pays Partenaires","Personnel des Pays Programmes"]
[null,{"$f":"Rates!C4","v":"Allemagne"},{"$f":"Rates!D4","v":"Pays Programmes"},{"$f":"Rates!E4","v":280},{"$f":"Rates!F4","v":214},{"$f":"Rates!G4","v":162},{"$f":"Rates!H4","v":131},null,{"$f":"Rates!P4","v":"0 KM et 9 KM"},{"$f":"Rates!Q4","v":0},null,1,{"$f":"L8*55","v":55},{"$f":"L8*120","v":120},null,null,null,null,null,null,null,null,{"$f":"Rates!N4","v":"Allemagne"},{"$f":"VLOOKUP(W8,Rates!$C$4:$L$182,2,FALSE)","v":"Pays Programmes"},{"$f":"VLOOKUP(W8,Rates!$C$4:$L$182,7,FALSE)","v":800},{"$f":"VLOOKUP(W8,Rates!$C$4:$L$182,8,FALSE)","v":0},{"$f":"VLOOKUP(W8,Rates!$C$4:$L$182,9,FALSE)","v":120},{"$f":"VLOOKUP(W8,Rates!$C$4:$L$182,10,FALSE)","v":0}]
[null,{"$f":"Rates!C5","v":"Ancienne République yougoslave de Macédoine"},{"$f":"Rates!D5","v":"Pays Programmes"},{"$f":"Rates!E5","v":88},{"$f":"Rates!F5","v":74},{"$f":"Rates!G5","v":55},{"$f":"Rates!H5","v":39},null,{"$f":"Rates!P5","v":"10 KM et 99 KM"},{"$f":"Rates!Q5","v":20},null,2,{"$f":"L9*55","v":110},{"$f":"L9*120","v":240},null,null,null,null,null,null,null,null,{"$f":"Rates!N5","v":"Ancienne République yougoslave de Macédoine"},{"$f":"VLOOKUP(W9,Rates!$C$4:$L$182,2,FALSE)","v":"Pays Programmes"},{"$f":"VLOOKUP(W9,Rates!$C$4:$L$182,7,FALSE)","v":750},{"$f":"VLOOKUP(W9,Rates!$C$4:$L$182,8,FALSE)","v":0},{"$f":"VLOOKUP(W9,Rates!$C$4:$L$182,9,FALSE)","v":120},{"$f":"VLOOKUP(W9,Rates!$C$4:$L$182,10,FALSE)","v":0}]
[null,{"$f":"Rates!C6","v":"Autriche"},{"$f":"Rates!D6","v":"Pays Programmes"},{"$f":"Rates!E6","v":294},{"$f":"Rates!F6","v":241},{"$f":"Rates!G6","v":190},{"$f":"Rates!H6","v":157},null,{"$f":"Rates!P6","v":"100 KM et 499 KM"},{"$f":"Rates!Q6","v":180},null,3,165,360,null,null,null,null,null,null,null,null,{"$f":"Rates!N6","v":"Autriche"},{"$f":"VLOOKUP(W10,Rates!$C$4:$L$182,2,FALSE)","v":"Pays Programmes"},{"$f":"VLOOKUP(W10,Rates!$C$4:$L$182,7,FALSE)","v":850},{"$f":"VLOOKUP(W10,Rates!$C$4:$L$182,8,FALSE)","v":0},{"$f":"VLOOKUP(W10,Rates!$C$4:$L$182,9,FALSE)","v":140},{"$f":"VLOOKUP(W10,Rates!$C$4:$L$182,10,FALSE)","v":0}]
{"$rows_left_out":176}