{"text_format":"1","workbook":"xlsx","n_sheets":11,"sheets":["Overview","1. Staff costs","2-3. Travel Costs&Costs of Stay","4. Equipment Costs","5. Subcontracting Costs","B. Special Mob Strand - Student","B. Special Mob Strand - Staff","Co-financing","Breakdown & Project Funding","Rates","Unit Costs & Funding Rule"],"not_rendered":{"charts":0,"images":2,"macros":1,"external_links":0,"defined_names":51,"comments":0,"pivot_tables":0},"unopened":[],"bounds":{"document_bytes":16777216,"sheet_cells":100000,"rows_first":2000,"rows_last":500,"rows_between":2000,"halvings":0,"cell_chars":16384,"cell_head_chars":4096},"cells_cut":0,"cells_raw":0,"read":"whole","date_system":"1900"}

{"sheet":"Overview","index":0,"n_rows":87,"n_cols":12,"rows_kept":87,"cut":false,"hidden":false,"merged":[[23,8,26,8],[23,10,26,10],[26,6,26,7],[25,6,25,7],[24,6,24,7],[23,6,23,7],[16,4,16,11],[6,1,6,11],[7,1,7,11],[8,1,8,11],[10,1,10,2],[11,1,11,2],[12,1,12,2],[15,1,15,11],[16,1,16,2],[12,4,12,11],[11,4,11,11],[10,4,10,11],[13,1,13,2],[13,3,13,11],[30,1,30,11],[17,1,17,2],[18,1,18,2],[19,1,19,2],[20,1,20,2],[28,1,28,2],[21,1,21,2],[21,4,21,11],[28,4,28,11],[20,4,20,11],[19,4,19,11],[18,4,18,11],[17,4,17,11],[23,1,26,2],[23,3,26,3],[23,4,26,5]]}
[]
[]
[null,null,null,"Key Action 2: Cooperation for innovation and the exchange of good practices"]
[null,null,null,"Capacity Building in the field of higher education"]
[]
[]
[null,"Before completing this table please read carefully the instructions available on "]
[null,"CALL FOR PROPOSALS 2017 – EAC/A03/2016 - Erasmus+ Programme (C2016/386/09)"]
[null,"Programme guide and instructions for applicants"]
[]
{"$rows_left_out":78}
{"sheet":"1. Staff costs","index":1,"n_rows":14,"n_cols":20,"rows_kept":14,"cut":false,"hidden":false,"merged":[[4,1,4,2],[3,1,3,2],[8,1,8,2],[2,1,2,18],[10,17,11,17],[10,19,11,19],[1,1,1,19],[10,18,11,18],[10,5,10,7],[10,8,10,10],[10,11,10,13],[10,14,10,16],[9,1,9,18],[3,6,8,19],[10,1,11,1],[10,4,11,4],[10,3,11,3],[10,2,11,2],[7,1,7,2],[6,1,6,2],[5,1,5,2]]}
[]
[null,"1. Staff Costs"]
[]
[null,null,null,"Total (EUR)","Number of Days"]
[null,"Manager",null,{"$f":"SUM(H:H)","v":0},{"$f":"SUMIF(T:T,\"<>Error\",F:F)","v":0}]
[null,"Teacher/Trainer/Researcher",null,{"$f":"SUM(K:K)","v":0},{"$f":"SUMIF(T:T,\"<>Error\",I:I)","v":0}]
[null,"Technical Staff",null,{"$f":"SUM(N:N)","v":0},{"$f":"SUMIF(T:T,\"<>Error\",L:L)","v":0}]
[null,"Administrative Staff",null,{"$f":"SUM(Q:Q)","v":0},{"$f":"SUMIF(T:T,\"<>Error\",O:O)","v":0}]
[null,null,null,{"$f":"SUM(D5:D8)","v":0},{"$f":"SUM(E5:E8)","v":0}]
[]
{"$rows_left_out":5}
{"sheet":"2-3. Travel Costs&Costs of Stay","index":2,"n_rows":14,"n_cols":15,"rows_kept":14,"cut":false,"hidden":false,"merged":[[10,14,11,14],[1,1,1,14],[10,5,11,5],[10,8,11,8],[10,7,11,7],[10,6,11,6],[10,4,11,4],[10,3,11,3],[10,13,11,13],[10,12,11,12],[10,11,11,11],[10,10,11,10],[10,9,11,9],[7,5,8,5],[5,5,6,5],[3,5,4,5],[7,4,8,4],[5,4,6,4],[3,4,4,4],[10,1,11,1],[10,2,11,2],[8,1,8,2],[7,1,7,2],[6,1,6,2],[5,1,5,2],[4,1,4,2],[3,1,3,2]]}
[]
[null,"2-3. Travel Costs & Costs of Stay"]
[]
[null,"Travel Costs Student (EUR)",null,{"$f":"SUMIF(G:G,\"Student\",L:L)","v":0},{"$f":"D4+D5","v":0},{"$f":"SUMIFS(H:H,G:G,\"Student\",O:O,\"<>Error\")","v":0}]
[null,"Costs of Stay Student (EUR)",null,{"$f":"SUMIF(G:G,\"Student\",M:M)","v":0}]
[null,"Travel Costs Staff (EUR)",null,{"$f":"SUMIF(G:G,\"Staff\",L:L)","v":0},{"$f":"D6+D7","v":0},{"$f":"SUMIFS(H:H,G:G,\"Staff\",O:O,\"<>Error\")","v":0}]
[null,"Costs of Stay Staff (EUR)",null,{"$f":"SUMIF(G:G,\"Staff\",M:M)","v":0}]
[null,"Total Travel Costs (EUR)",null,{"$f":"SUM(L:L)","v":0},{"$f":"D8+D9","v":0},{"$f":"F4+F6","v":0}]
[null,"Total Costs of Stay (EUR)",null,{"$f":"SUM(M:M)","v":0}]
[]
{"$rows_left_out":5}
{"sheet":"4. Equipment Costs","index":3,"n_rows":14,"n_cols":9,"rows_kept":14,"cut":false,"hidden":false,"merged":[[10,8,11,8],[1,1,1,8],[10,7,11,7],[10,6,11,6],[10,5,11,5],[10,4,11,4],[3,1,8,1],[3,2,8,3],[10,3,11,3],[10,1,11,1],[10,2,11,2]]}
[]
[null,"4. Equipment Costs"]
[]
[null,"Total (EUR)",{"$f":"SUM(H:H)","v":0}]
[]
[]
[]
[]
[]
[]
{"$rows_left_out":5}
{"sheet":"5. Subcontracting Costs","index":4,"n_rows":14,"n_cols":9,"rows_kept":14,"cut":false,"hidden":false,"merged":[[10,8,11,8],[1,1,1,8],[10,7,11,7],[3,1,8,1],[3,2,8,3],[10,1,11,1],[10,2,11,2],[10,3,11,3],[10,4,11,4],[10,5,11,5],[10,6,11,6]]}
[]
[null,"5. Subcontracting Costs"]
[]
[null,"Total (EUR)",{"$f":"SUM(H:H)","v":0}]
[]
[]
[]
[]
[]
[]
{"$rows_left_out":5}
{"sheet":"B. Special Mob Strand - Student","index":5,"n_rows":14,"n_cols":18,"rows_kept":14,"cut":false,"hidden":false,"merged":[[10,1,11,1],[10,2,11,2],[10,3,11,3],[10,4,11,4],[10,6,11,6],[10,14,11,14],[1,1,1,14],[10,10,11,10],[10,11,11,11],[10,12,11,12],[10,13,11,13],[10,8,11,8],[10,9,11,9],[3,1,4,1],[3,2,4,2],[5,1,6,1],[5,2,6,2],[7,1,8,1],[7,2,8,2],[10,5,11,5],[10,7,11,7]]}
[]
[null,"B. Special Mobility Strand - Student"]
[]
[null,"Travel Costs",{"$f":"SUM(L:L)","v":0}]
[]
[null,"Subsistence Costs",{"$f":"SUM(M:M)","v":0}]
[]
[null,"Total (EUR)",{"$f":"C4+C6","v":0}]
[]
[]
{"$rows_left_out":5}
{"sheet":"B. Special Mob Strand - Staff","index":6,"n_rows":14,"n_cols":18,"rows_kept":14,"cut":false,"hidden":false,"merged":[[10,3,11,3],[3,1,4,1],[3,2,4,2],[5,1,6,1],[5,2,6,2],[10,14,11,14],[1,1,1,14],[10,4,11,4],[10,5,11,5],[10,13,11,13],[10,7,11,7],[10,8,11,8],[10,9,11,9],[10,10,11,10],[10,11,11,11],[10,12,11,12],[10,6,11,6],[7,1,8,1],[7,2,8,2],[10,1,11,1],[10,2,11,2]]}
[]
[null,"B. Special Mobility Strand - Staff"]
[]
[null,"Travel Costs",{"$f":"SUM(L:L)","v":0}]
[]
[null,"Subsistence Costs",{"$f":"SUM(M:M)","v":0}]
[]
[null,"Total (EUR)",{"$f":"C4+C6","v":0}]
[]
[]
{"$rows_left_out":5}
{"sheet":"Co-financing","index":7,"n_rows":18,"n_cols":10,"rows_kept":18,"cut":false,"hidden":false,"merged":[[10,9,11,9],[1,1,1,9],[10,8,11,8],[10,5,11,5],[3,2,8,2],[3,1,8,1],[10,1,11,1],[10,2,11,2],[10,3,11,3],[10,6,11,6],[10,7,11,7],[10,4,11,4]]}
[]
[null,"Information for the Co-financing"]
[]
[null,"Total (EUR)",{"$f":"SUM(I:I)","v":0}]
[]
[]
[]
[]
[]
[]
{"$rows_left_out":9}
{"sheet":"Breakdown & Project Funding","index":8,"n_rows":81,"n_cols":9,"rows_kept":81,"cut":false,"hidden":false,"merged":[[1,1,1,8],[13,1,13,8],[4,7,8,7],[22,1,22,8]]}
[]
[null,"Budget Breakdown by Workpackage / Budget Headings"]
[]
[null,"Work\nPackage","1. Staff \nCosts","2. Travel \nCosts","3. Costs \nof Stay","4. Equipment\nCosts","5. Subcontracting\nCosts","B. Special \nMobility Strand","Total\n(EUR)"]
[null,{"$f":"Rates!P14","v":"Preparation"},{"$f":"SUMIF('1. Staff costs'!B:B,B5,'1. Staff costs'!S:S)","v":0},{"$f":"SUMIF('2-3. Travel Costs&Costs of Stay'!B:B,B5,'2-3. Travel Costs&Costs of Stay'!L:L)","v":0},{"$f":"SUMIF('2-3. Travel Costs&Costs of Stay'!B:B,B5,'2-3. Travel Costs&Costs of Stay'!M:M)","v":0},{"$f":"SUMIF('4. Equipment Costs'!B:B,B5,'4. Equipment Costs'!H:H)","v":0},{"$f":"SUMIF('5. Subcontracting Costs'!B:B,B5,'5. Subcontracting Costs'!H:H)","v":0},null,{"$f":"SUM(C5:G5)","v":0}]
[null,{"$f":"Rates!P15","v":"Development"},{"$f":"SUMIF('1. Staff costs'!B:B,B6,'1. Staff costs'!S:S)","v":0},{"$f":"SUMIF('2-3. Travel Costs&Costs of Stay'!B:B,B6,'2-3. Travel Costs&Costs of Stay'!L:L)","v":0},{"$f":"SUMIF('2-3. Travel Costs&Costs of Stay'!B:B,B6,'2-3. Travel Costs&Costs of Stay'!M:M)","v":0},{"$f":"SUMIF('4. Equipment Costs'!B:B,B6,'4. Equipment Costs'!H:H)","v":0},{"$f":"SUMIF('5. Subcontracting Costs'!B:B,B6,'5. Subcontracting Costs'!H:H)","v":0},null,{"$f":"SUM(C6:G6)","v":0}]
[null,{"$f":"Rates!P16","v":"Quality Plan"},{"$f":"SUMIF('1. Staff costs'!B:B,B7,'1. Staff costs'!S:S)","v":0},{"$f":"SUMIF('2-3. Travel Costs&Costs of Stay'!B:B,B7,'2-3. Travel Costs&Costs of Stay'!L:L)","v":0},{"$f":"SUMIF('2-3. Travel Costs&Costs of Stay'!B:B,B7,'2-3. Travel Costs&Costs of Stay'!M:M)","v":0},{"$f":"SUMIF('4. Equipment Costs'!B:B,B7,'4. Equipment Costs'!H:H)","v":0},{"$f":"SUMIF('5. Subcontracting Costs'!B:B,B7,'5. Subcontracting Costs'!H:H)","v":0},null,0]
[null,{"$f":"Rates!P17","v":"Dissemination & Exploitation"},{"$f":"SUMIF('1. Staff costs'!B:B,B8,'1. Staff costs'!S:S)","v":0},{"$f":"SUMIF('2-3. Travel Costs&Costs of Stay'!B:B,B8,'2-3. Travel Costs&Costs of Stay'!L:L)","v":0},{"$f":"SUMIF('2-3. Travel Costs&Costs of Stay'!B:B,B8,'2-3. Travel Costs&Costs of Stay'!M:M)","v":0},{"$f":"SUMIF('4. Equipment Costs'!B:B,B8,'4. Equipment Costs'!H:H)","v":0},{"$f":"SUMIF('5. Subcontracting Costs'!B:B,B8,'5. Subcontracting Costs'!H:H)","v":0},null,0]
[null,{"$f":"Rates!P18","v":"Management"},{"$f":"SUMIF('1. Staff costs'!B:B,B9,'1. Staff costs'!S:S)","v":0},{"$f":"SUMIF('2-3. Travel Costs&Costs of Stay'!B:B,B9,'2-3. Travel Costs&Costs of Stay'!L:L)","v":0},{"$f":"SUMIF('2-3. Travel Costs&Costs of Stay'!B:B,B9,'2-3. Travel Costs&Costs of Stay'!M:M)","v":0},{"$f":"SUMIF('4. Equipment Costs'!B:B,B9,'4. Equipment Costs'!H:H)","v":0},{"$f":"SUMIF('5. Subcontracting Costs'!B:B,B9,'5. Subcontracting Costs'!H:H)","v":0},null,0]
[null,"Total",{"$f":"SUM(C5:C9)","v":0},0,0,0,{"$f":"SUM(G5:G9)","v":0},{"$f":"'B. Special Mob Strand - Student'!C8+'B. Special Mob Strand - Staff'!C8","v":0},{"$f":"SUM(C10:H10)","v":0}]
{"$rows_left_out":72}
{"sheet":"Rates","index":9,"n_rows":182,"n_cols":17,"rows_kept":182,"cut":false,"hidden":true,"merged":[[1,4,1,7],[1,8,1,11]]}
[]
[null,null,null,null,"Staff Costs",null,null,null,"SMS"]
[null,null,"Country","PR/PA","Manager","Teacher/Trainer/Researcher","Technical Staff","Administrative Staff","Students from Partner Countries","Students from Programme Countries","Staff from Partner Countries","Staff from Programme Countries",null,"Country\nSMS",null,"Distance","Travel \nCosts\n(EUR)"]
[null,1,"Austria","Programme Countries",294,241,190,157,850,0,140,0,null,"Austria",null,"0 KM and 9 KM",0]
[null,2,"Belgium","Programme Countries",280,214,162,131,800,0,140,0,null,"Belgium",null,"10 KM and 99 KM",20]
[null,3,"Bulgaria","Programme Countries",88,74,55,39,750,0,140,0,null,"Bulgaria",null,"100 KM and 499 KM",180]
[null,4,"Croatia","Programme Countries",88,74,55,39,800,0,100,0,null,"Croatia",null,"500 KM and 1999 KM",275]
[null,5,"Cyprus","Programme Countries",164,137,102,78,800,0,140,0,null,"Cyprus",null,"2000 KM and 2999 KM",360]
[null,6,"Czech Republic","Programme Countries",164,137,102,78,800,0,140,0,null,"Czech Republic",null,"3000 KM and 3999 KM",530]
[null,7,"Denmark","Programme Countries",294,241,190,157,850,0,160,0,null,"Denmark",null,"4000 KM and 7999 KM",820]
{"$rows_left_out":173}
{"sheet":"Unit Costs & Funding Rule","index":10,"n_rows":186,"n_cols":28,"rows_kept":186,"cut":false,"hidden":false,"merged":[[4,22,4,27],[5,22,5,27],[0,1,0,27],[3,1,3,6],[3,8,3,9],[3,11,3,13],[3,15,3,16],[3,18,3,20],[3,22,3,27],[2,2,2,7],[1,2,1,7],[6,15,6,16],[6,18,6,20],[4,1,5,6],[4,8,5,9],[4,11,5,13],[4,15,5,16],[4,18,5,20]]}
[null,"UNIT COSTS AND SUMMARY OF THE FUNDING RULES FOR  JOINT AND STRUCTURAL CAPACITY BUILDING PROJECTS\n\nYou can find below the unit costs values used in this file for the calculation of the grant.\nPlease refer to the Erasmus+ Programme guide 2017* for a complete overview of the funding rules applying to the Joint and Structural Capacity Building Projects (Part B of the guide and Annex 1)."]
[null,"* Link to Erasmus+ Programme guide 2017: ","http://ec.europa.eu/programmes/erasmus-plus/resources_en"]
[null,"* Link to CBHE Call for proposal, forms, annexes and guidelines: ","http://eur-lex.europa.eu/legal-content/EN/TXT/?uri=OJ:JOC_2016_386_R_0009"]
[null,"A.1 Staff Costs",null,null,null,null,null,null,"A.2 & B Travel Costs",null,null,"A. 3 Costs of Stay",null,null,null,"A.4 Equipment",null,null,"A.5 Subcontracting",null,null,null,"B - Special Mobility Strand"]
[null,"Unit costs\n\nContribution to the costs of staff performing tasks which are directly necessary to the achievements of the project's objectives.\n\nConditional: applicants will have to justify the type and volume of resources needed in relation to the implementation of the proposed activities and outputs. The contribution is provided on the  condition that the salary for the same tasks is compensated only once.",null,null,null,null,null,null,"Unit costs based on the travel distance per participant. \n\nTravel distances must be calculated using the distance calculator supported by the European Commission . \nThe applicant must indicate the distance of a one-way travel to calculate the amount of the EU grant that will support the round trip.",null,null,"Costs for subsistence, accommodation, local and public transport such as bus and taxi, personal or optional health insurance.\n\nUnit costs based on the duration of the stay of the participants:\n\nStaff: \n120 EUR/day from day 1 to day 14\n70 EUR/day from day 15 to day 60\n50 EUR/day from day 61 to day 90 (the maximum)\n\nStudent: \n55 EUR/day from day 1 to day 14\n40 EUR/day from day 15 to max day 90 (the maximum)",null,null,null,"Contribution for the purchase of equipment necessary for the implementation of the project. Support is provided only for equipment purchased for the benefit of the HEIs in the Partner Countries. \n\nConditional: the request for financial support to cover these costs must be motivated in the application form",null,null,"Support for sub-contracting costs that are necessary to the implementation of the project, including, in particular, costs for the compulsory financial audits (audit certificate) and for any external quality assurance procedure.\n\nSub-contracting for project-management-related tasks is not eligible.\n\nSub-contracting to external bodies should be very occasional. The specific competences and particular expertise needed to reach the project objectives should be found in the consortium and should determine its composition.",null,null,null,"Travel costs (students and staff):  Unit costs (please refer to unit costs in table A2).\nContribution to the travel costs of students and staff involved in the project, from their place of origin to the venue of the activity and return (including visa fee and related obligatory insurance, travel insurance and cancellation costs if justified).\n\nActivities and related travels must be carried out in the countries involved in the project. Any exception to this rule must be authorised by the Agency. For the detailed list of eligible activities, see Annex I of this Guide.\n\nSubsistence costs:  Unit costs based on the duration of the stay of the participants.\nCosts for subsistence, accommodation, local and public transport such as bus and taxi, personal or optional health insurance. Based on the duration of the stay per participant."]
[null,null,null,null,null,null,null,null,null,null,null,null,null,null,null,null,null,null,null,null,null,null,"Subsistence costs for Special Mobility Strand"]
[null,"Country","PR/PA","Manager","Teacher/Trainer/Researcher","Technical\nStaff","Administrative\nStaff",null,"Distance","Travel \nCosts\n(EUR)",null,"Number of \nDays","Student","Staff",null,"100% of eligible costs\nMax. 30% of the total grant",null,null,"100% of eligible costs\nMax. 10% of the total grant",null,null,null,"Country","PR/PA","Students from Partner Countries\n(per month)","Students from Programme Countries\n(per month)","Staff from \nPartner Countries\n(per day)","Staff from Programme Countries\n(per day)"]
[null,{"$f":"Rates!C4","v":"Austria"},{"$f":"Rates!D4","v":"Programme Countries"},{"$f":"Rates!E4","v":294},{"$f":"Rates!F4","v":241},{"$f":"Rates!G4","v":190},{"$f":"Rates!H4","v":157},null,{"$f":"Rates!P4","v":"0 KM and 9 KM"},{"$f":"Rates!Q4","v":0},null,1,{"$f":"L8*55","v":55},{"$f":"L8*120","v":120},null,null,null,null,null,null,null,null,{"$f":"Rates!N4","v":"Austria"},{"$f":"VLOOKUP(W8,Rates!$C$4:$L$182,2,FALSE)","v":"Programme Countries"},{"$f":"VLOOKUP(W8,Rates!$C$4:$L$182,7,FALSE)","v":850},{"$f":"VLOOKUP(W8,Rates!$C$4:$L$182,8,FALSE)","v":0},{"$f":"VLOOKUP(W8,Rates!$C$4:$L$182,9,FALSE)","v":140},{"$f":"VLOOKUP(W8,Rates!$C$4:$L$182,10,FALSE)","v":0}]
[null,{"$f":"Rates!C5","v":"Belgium"},{"$f":"Rates!D5","v":"Programme Countries"},{"$f":"Rates!E5","v":280},{"$f":"Rates!F5","v":214},{"$f":"Rates!G5","v":162},{"$f":"Rates!H5","v":131},null,{"$f":"Rates!P5","v":"10 KM and 99 KM"},{"$f":"Rates!Q5","v":20},null,2,{"$f":"L9*55","v":110},{"$f":"L9*120","v":240},null,null,null,null,null,null,null,null,{"$f":"Rates!N5","v":"Belgium"},{"$f":"VLOOKUP(W9,Rates!$C$4:$L$182,2,FALSE)","v":"Programme Countries"},{"$f":"VLOOKUP(W9,Rates!$C$4:$L$182,7,FALSE)","v":800},{"$f":"VLOOKUP(W9,Rates!$C$4:$L$182,8,FALSE)","v":0},{"$f":"VLOOKUP(W9,Rates!$C$4:$L$182,9,FALSE)","v":140},{"$f":"VLOOKUP(W9,Rates!$C$4:$L$182,10,FALSE)","v":0}]
[null,{"$f":"Rates!C6","v":"Bulgaria"},{"$f":"Rates!D6","v":"Programme Countries"},{"$f":"Rates!E6","v":88},{"$f":"Rates!F6","v":74},{"$f":"Rates!G6","v":55},{"$f":"Rates!H6","v":39},null,{"$f":"Rates!P6","v":"100 KM and 499 KM"},{"$f":"Rates!Q6","v":180},null,3,165,360,null,null,null,null,null,null,null,null,{"$f":"Rates!N6","v":"Bulgaria"},{"$f":"VLOOKUP(W10,Rates!$C$4:$L$182,2,FALSE)","v":"Programme Countries"},{"$f":"VLOOKUP(W10,Rates!$C$4:$L$182,7,FALSE)","v":750},{"$f":"VLOOKUP(W10,Rates!$C$4:$L$182,8,FALSE)","v":0},{"$f":"VLOOKUP(W10,Rates!$C$4:$L$182,9,FALSE)","v":140},{"$f":"VLOOKUP(W10,Rates!$C$4:$L$182,10,FALSE)","v":0}]
{"$rows_left_out":176}