{"text_format":"1","workbook":"xlsx","n_sheets":11,"sheets":["Übersicht","1. Personalkosten","2-3. Reise&Unterkunftskosten","4. Ausrüstungskosten","5. Kosten für Unteraufträge","B. Spezieller Mob. - Student","B. Spezieller Mob. - Personal","Kofinanzierung","Aufschlüsselung des Budgets","Rates","Kosten und Finanzierung"],"not_rendered":{"charts":0,"images":2,"macros":1,"external_links":0,"defined_names":51,"comments":0,"pivot_tables":0},"unopened":[],"bounds":{"document_bytes":16777216,"sheet_cells":100000,"rows_first":2000,"rows_last":500,"rows_between":2000,"halvings":0,"cell_chars":16384,"cell_head_chars":4096},"cells_cut":0,"cells_raw":0,"read":"whole","date_system":"1900"}

{"sheet":"Übersicht","index":0,"n_rows":87,"n_cols":12,"rows_kept":87,"cut":false,"hidden":false,"merged":[[30,1,30,11],[17,1,17,2],[18,1,18,2],[19,1,19,2],[20,1,20,2],[28,1,28,2],[21,1,21,2],[21,4,21,11],[28,4,28,11],[20,4,20,11],[19,4,19,11],[18,4,18,11],[17,4,17,11],[23,1,26,2],[23,3,26,3],[23,4,26,5],[16,4,16,11],[6,1,6,11],[7,1,7,11],[8,1,8,11],[10,1,10,2],[11,1,11,2],[12,1,12,2],[15,1,15,11],[16,1,16,2],[12,4,12,11],[11,4,11,11],[10,4,10,11],[13,1,13,2],[13,3,13,11],[23,8,26,8],[23,10,26,10],[26,6,26,7],[25,6,25,7],[24,6,24,7],[23,6,23,7]]}
[]
[]
[null,null,null,"Leitaktion 2: Zusammenarbeit zur Förderung von Innovation und zum Austausch über bewährte Verfahren"]
[null,null,null,"Kapazitätsaufbau im Hochschulbereich"]
[]
[]
[null,"Bevor Sie diese Tabelle ausfüllen, lesen Sie bitte sorgfältig die Anweisungen auf"]
[null,"AUFFORDERUNG ZUR EINREICHUNG VON VORSCHLÄGEN 2017 – EAC/A03/2016 - Erasmus+ Programme (C2016/386/09)"]
[null,"Programmleitfaden und Anweisungen für Antragsteller"]
[]
{"$rows_left_out":78}
{"sheet":"1. Personalkosten","index":1,"n_rows":14,"n_cols":20,"rows_kept":14,"cut":false,"hidden":false,"merged":[[10,19,11,19],[1,1,1,19],[10,18,11,18],[10,5,10,7],[10,8,10,10],[10,11,10,13],[10,14,10,16],[9,1,9,18],[3,6,8,19],[10,1,11,1],[10,4,11,4],[10,3,11,3],[10,2,11,2],[7,1,7,2],[6,1,6,2],[5,1,5,2],[4,1,4,2],[3,1,3,2],[8,1,8,2],[2,1,2,18],[10,17,11,17]]}
[]
[null,"1. Personalkosten"]
[]
[null,null,null,"Gesamtbetrag (EUR)","Anzahl von Tagen"]
[null,"Manager",null,{"$f":"SUM(H:H)","v":0},{"$f":"SUMIF(T:T,\"<>Fehler\",F:F)","v":0}]
[null,"Lehrkraft/Ausbilder/Forscher",null,{"$f":"SUM(K:K)","v":0},{"$f":"SUMIF(T:T,\"<>Fehler\",I:I)","v":0}]
[null,"Techniker",null,{"$f":"SUM(N:N)","v":0},{"$f":"SUMIF(T:T,\"<>Fehler\",L:L)","v":0}]
[null,"Verwaltungskraft",null,{"$f":"SUM(Q:Q)","v":0},{"$f":"SUMIF(T:T,\"<>Fehler\",O:O)","v":0}]
[null,null,null,{"$f":"SUM(D5:D8)","v":0},{"$f":"SUM(E5:E8)","v":0}]
[]
{"$rows_left_out":5}
{"sheet":"2-3. Reise&Unterkunftskosten","index":2,"n_rows":14,"n_cols":15,"rows_kept":14,"cut":false,"hidden":false,"merged":[[7,4,8,4],[5,4,6,4],[3,4,4,4],[10,1,11,1],[10,2,11,2],[8,1,8,2],[7,1,7,2],[6,1,6,2],[5,1,5,2],[4,1,4,2],[3,1,3,2],[10,14,11,14],[1,1,1,14],[10,5,11,5],[10,8,11,8],[10,7,11,7],[10,6,11,6],[10,4,11,4],[10,3,11,3],[10,13,11,13],[10,12,11,12],[10,11,11,11],[10,10,11,10],[10,9,11,9],[7,5,8,5],[5,5,6,5],[3,5,4,5]]}
[]
[null,"2-3. Reise&Unterkunftskosten"]
[]
[null,"Reisekosten Student (EUR)",null,{"$f":"SUMIF(G:G,\"Student\",L:L)","v":0},{"$f":"D4+D5","v":0},{"$f":"SUMIFS(H:H,G:G,\"Student\",O:O,\"<>Fehler\")","v":0}]
[null,"Unterhaltskosten Student (EUR)",null,{"$f":"SUMIF(G:G,\"Student\",M:M)","v":0}]
[null,"Reisekosten Personal (EUR)",null,{"$f":"SUMIF(G:G,\"Personal\",L:L)","v":0},{"$f":"D6+D7","v":0},{"$f":"SUMIFS(H:H,G:G,\"Personal\",O:O,\"<>Fehler\")","v":0}]
[null,"Unterhaltskosten Personal (EUR)",null,{"$f":"SUMIF(G:G,\"Personal\",M:M)","v":0}]
[null,"Gesamtbetrag Reisekosten (EUR)",null,{"$f":"SUM(L:L)","v":0},{"$f":"D8+D9","v":0},{"$f":"F4+F6","v":0}]
[null,"Gesamtbetrag Unterhaltskosten (EUR)",null,{"$f":"SUM(M:M)","v":0}]
[]
{"$rows_left_out":5}
{"sheet":"4. Ausrüstungskosten","index":3,"n_rows":14,"n_cols":9,"rows_kept":14,"cut":false,"hidden":false,"merged":[[10,8,11,8],[1,1,1,8],[10,7,11,7],[10,6,11,6],[10,5,11,5],[10,4,11,4],[3,1,8,1],[3,2,8,3],[10,3,11,3],[10,1,11,1],[10,2,11,2]]}
[]
[null,"4. Ausrüstungskosten"]
[]
[null,"GESAMTBETRAG \n(EUR)",{"$f":"SUM(H:H)","v":0}]
[]
[]
[]
[]
[]
[]
{"$rows_left_out":5}
{"sheet":"5. Kosten für Unteraufträge","index":4,"n_rows":14,"n_cols":9,"rows_kept":14,"cut":false,"hidden":false,"merged":[[10,8,11,8],[1,1,1,8],[10,7,11,7],[3,1,8,1],[3,2,8,3],[10,1,11,1],[10,2,11,2],[10,3,11,3],[10,4,11,4],[10,5,11,5],[10,6,11,6]]}
[]
[null,"5. Kosten für Unteraufträge"]
[]
[null,"GESAMTBETRAG \n(EUR)",{"$f":"SUM(H:H)","v":0}]
[]
[]
[]
[]
[]
[]
{"$rows_left_out":5}
{"sheet":"B. Spezieller Mob. - Student","index":5,"n_rows":14,"n_cols":18,"rows_kept":14,"cut":false,"hidden":false,"merged":[[10,14,11,14],[1,1,1,14],[10,10,11,10],[10,11,11,11],[10,12,11,12],[10,13,11,13],[10,8,11,8],[10,9,11,9],[3,1,4,1],[3,2,4,2],[5,1,6,1],[5,2,6,2],[7,1,8,1],[7,2,8,2],[10,5,11,5],[10,7,11,7],[10,1,11,1],[10,2,11,2],[10,3,11,3],[10,4,11,4],[10,6,11,6]]}
[]
[null,"B. Spezieller Mobilitätsbereich - Student"]
[]
[null,"Reisekosten",{"$f":"SUM(L:L)","v":0}]
[]
[null,"Unterhaltskosten",{"$f":"SUM(M:M)","v":0}]
[]
[null,"Gesamtbetrag (EUR)",{"$f":"C4+C6","v":0}]
[]
[]
{"$rows_left_out":5}
{"sheet":"B. Spezieller Mob. - Personal","index":6,"n_rows":14,"n_cols":18,"rows_kept":14,"cut":false,"hidden":false,"merged":[[10,14,11,14],[1,1,1,14],[10,4,11,4],[10,5,11,5],[10,13,11,13],[10,7,11,7],[10,8,11,8],[10,9,11,9],[10,10,11,10],[10,11,11,11],[10,12,11,12],[10,6,11,6],[7,1,8,1],[7,2,8,2],[10,1,11,1],[10,2,11,2],[10,3,11,3],[3,1,4,1],[3,2,4,2],[5,1,6,1],[5,2,6,2]]}
[]
[null,"B. Spezieller Mobilitätsbereich - Personal"]
[]
[null,"Reisekosten",{"$f":"SUM(L:L)","v":0}]
[]
[null,"Unterhaltskosten",{"$f":"SUM(M:M)","v":0}]
[]
[null,"Gesamtbetrag (EUR)",{"$f":"C4+C6","v":0}]
[]
[]
{"$rows_left_out":5}
{"sheet":"Kofinanzierung","index":7,"n_rows":18,"n_cols":10,"rows_kept":18,"cut":false,"hidden":false,"merged":[[10,9,11,9],[1,1,1,9],[10,8,11,8],[10,5,11,5],[3,2,8,2],[3,1,8,1],[10,1,11,1],[10,2,11,2],[10,3,11,3],[10,6,11,6],[10,7,11,7],[10,4,11,4]]}
[]
[null,"Information zur Kofinanzierung"]
[]
[null,"GESAMTBETRAG \n(EUR)",{"$f":"SUM(I:I)","v":0}]
[]
[]
[]
[]
[]
[]
{"$rows_left_out":9}
{"sheet":"Aufschlüsselung des Budgets","index":8,"n_rows":81,"n_cols":9,"rows_kept":81,"cut":false,"hidden":false,"merged":[[1,1,1,8],[13,1,13,8],[4,7,8,7],[22,1,22,8]]}
[]
[null,"Aufschlüsselung des Budgets nach Arbeitspaketen/Haushaltslinien"]
[]
[null,"Arbeitspaket","1. Personalkosten","2. Reisekosten","3. Unterkunftskosten","4. Ausrüstungskosten","5. Kosten für Unteraufträge","B. Spezieller Mobilitätsbereich","Gesamtbetrag\n(EUR)"]
[null,{"$f":"Rates!P14","v":"Vorbereitung"},{"$f":"SUMIF('1. Personalkosten'!B:B,B5,'1. Personalkosten'!S:S)","v":0},{"$f":"SUMIF('2-3. Reise&Unterkunftskosten'!B:B,B5,'2-3. Reise&Unterkunftskosten'!L:L)","v":0},{"$f":"SUMIF('2-3. Reise&Unterkunftskosten'!B:B,B5,'2-3. Reise&Unterkunftskosten'!M:M)","v":0},{"$f":"SUMIF('4. Ausrüstungskosten'!B:B,B5,'4. Ausrüstungskosten'!H:H)","v":0},{"$f":"SUMIF('5. Kosten für Unteraufträge'!B:B,B5,'5. Kosten für Unteraufträge'!H:H)","v":0},null,{"$f":"SUM(C5:G5)","v":0}]
[null,{"$f":"Rates!P15","v":"Entwicklung"},{"$f":"SUMIF('1. Personalkosten'!B:B,B6,'1. Personalkosten'!S:S)","v":0},{"$f":"SUMIF('2-3. Reise&Unterkunftskosten'!B:B,B6,'2-3. Reise&Unterkunftskosten'!L:L)","v":0},{"$f":"SUMIF('2-3. Reise&Unterkunftskosten'!B:B,B6,'2-3. Reise&Unterkunftskosten'!M:M)","v":0},{"$f":"SUMIF('4. Ausrüstungskosten'!B:B,B6,'4. Ausrüstungskosten'!H:H)","v":0},{"$f":"SUMIF('5. Kosten für Unteraufträge'!B:B,B6,'5. Kosten für Unteraufträge'!H:H)","v":0},null,{"$f":"SUM(C6:G6)","v":0}]
[null,{"$f":"Rates!P16","v":"Qualitätssicherungsplan"},{"$f":"SUMIF('1. Personalkosten'!B:B,B7,'1. Personalkosten'!S:S)","v":0},{"$f":"SUMIF('2-3. Reise&Unterkunftskosten'!B:B,B7,'2-3. Reise&Unterkunftskosten'!L:L)","v":0},{"$f":"SUMIF('2-3. Reise&Unterkunftskosten'!B:B,B7,'2-3. Reise&Unterkunftskosten'!M:M)","v":0},{"$f":"SUMIF('4. Ausrüstungskosten'!B:B,B7,'4. Ausrüstungskosten'!H:H)","v":0},{"$f":"SUMIF('5. Kosten für Unteraufträge'!B:B,B7,'5. Kosten für Unteraufträge'!H:H)","v":0},null,0]
[null,{"$f":"Rates!P17","v":"Verbeitung und Nutzung der Ergebnisse"},{"$f":"SUMIF('1. Personalkosten'!B:B,B8,'1. Personalkosten'!S:S)","v":0},{"$f":"SUMIF('2-3. Reise&Unterkunftskosten'!B:B,B8,'2-3. Reise&Unterkunftskosten'!L:L)","v":0},{"$f":"SUMIF('2-3. Reise&Unterkunftskosten'!B:B,B8,'2-3. Reise&Unterkunftskosten'!M:M)","v":0},{"$f":"SUMIF('4. Ausrüstungskosten'!B:B,B8,'4. Ausrüstungskosten'!H:H)","v":0},{"$f":"SUMIF('5. Kosten für Unteraufträge'!B:B,B8,'5. Kosten für Unteraufträge'!H:H)","v":0},null,0]
[null,{"$f":"Rates!P18","v":"Verwaltung"},{"$f":"SUMIF('1. Personalkosten'!B:B,B9,'1. Personalkosten'!S:S)","v":0},{"$f":"SUMIF('2-3. Reise&Unterkunftskosten'!B:B,B9,'2-3. Reise&Unterkunftskosten'!L:L)","v":0},{"$f":"SUMIF('2-3. Reise&Unterkunftskosten'!B:B,B9,'2-3. Reise&Unterkunftskosten'!M:M)","v":0},{"$f":"SUMIF('4. Ausrüstungskosten'!B:B,B9,'4. Ausrüstungskosten'!H:H)","v":0},{"$f":"SUMIF('5. Kosten für Unteraufträge'!B:B,B9,'5. Kosten für Unteraufträge'!H:H)","v":0},null,0]
[null,"Gesamtbetrag",{"$f":"SUM(C5:C9)","v":0},0,0,0,{"$f":"SUM(G5:G9)","v":0},{"$f":"'B. Spezieller Mob. - Student'!C8+'B. Spezieller Mob. - Personal'!C8","v":0},{"$f":"SUM(C10:H10)","v":0}]
{"$rows_left_out":72}
{"sheet":"Rates","index":9,"n_rows":182,"n_cols":17,"rows_kept":182,"cut":false,"hidden":true,"merged":[[1,4,1,7],[1,8,1,11]]}
[]
[null,null,null,null,"Staff Costs",null,null,null,"SMS"]
[null,null,"Land","PR/PA","Manager","Lehrkraft/Ausbilder/Forscher","Techniker","Verwaltungskraft","Student von Partnerländer","Student von Programmländer","Personal von Partnerländer","Personal von Programmländer",null,"Country\nSMS",null,"Distance","Travel \nCosts\n(EUR)"]
[null,1,"Belgien","Programmländer",280,214,162,131,800,0,140,0,null,"Belgien",null,"0 KM und 9 KM",0]
[null,2,"Bulgarien","Programmländer",88,74,55,39,750,0,140,0,null,"Bulgarien",null,"10 KM und 99 KM",20]
[null,3,"Dänemark","Programmländer",294,241,190,157,850,0,160,0,null,"Dänemark",null,"100 KM und 499 KM",180]
[null,4,"Deutschland","Programmländer",280,214,162,131,800,0,120,0,null,"Deutschland",null,"500 KM und 1999 KM",275]
[null,5,"Ehemalige jugoslawische Republik Mazedonien","Programmländer",88,74,55,39,750,0,120,0,null,"Ehemalige jugoslawische Republik Mazedonien",null,"2000 KM und 2999 KM",360]
[null,6,"Estland","Programmländer",88,74,55,39,750,0,100,0,null,"Estland",null,"3000 KM und 3999 KM",530]
[null,7,"Finnland","Programmländer",280,214,162,131,850,0,140,0,null,"Finnland",null,"4000 KM und 7999 KM",820]
{"$rows_left_out":173}
{"sheet":"Kosten und Finanzierung","index":10,"n_rows":186,"n_cols":28,"rows_kept":186,"cut":false,"hidden":false,"merged":[[6,15,6,16],[6,18,6,20],[4,1,5,6],[4,8,5,9],[4,11,5,13],[4,15,5,16],[4,18,5,20],[4,22,4,27],[5,22,5,27],[0,1,0,27],[3,1,3,6],[3,8,3,9],[3,11,3,13],[3,15,3,16],[3,18,3,20],[3,22,3,27],[2,2,2,7],[1,2,1,7]]}
[null,"KOSTEN JE EINHEIT UND ZUSAMMENFASSUNG DER REGELN FÜR DIE FINANZIERUNG VON GEMEINSAMEN UND STRUKTURELLEN PROJEKTEN ZUM KAPAZITÄTSAUFBAU\n\nNachstehend finden Sie die Kosten je Leistungseinheit dieser Datei für die Berechnung der Finanzhilfe.\nIm Erasmus+ Programmleitfaden 2017* finden Sie einen vollständigen Überblick über die Finanzierungsvorschriften für die gemeinsamen und strukturellen Projekte zum Kapazitätsaufbau im Hochschulbereich (Teil B und Anhang 1)."]
[null,"* Web-Link zum Erasmus+ Programmleitfaden 2017: ","http://ec.europa.eu/programmes/erasmus-plus/resources_en"]
[null,"* Web-Link zur Aufforderung zur Einreichung von Vorschlägen, Antragsformulare, Anhänge und Leitlinien: ","http://eur-lex.europa.eu/legal-content/EN/TXT/?uri=OJ:JOC_2016_386_R_0009"]
[null,"A.1 Personalkosten",null,null,null,null,null,null,"A.2 & B Reisekosten",null,null,"A. 3 Unterkunftskosten",null,null,null,"A.4 Ausrüstung",null,null,"A.5 Vergabe von Unteraufträgen",null,null,null,"B - Spezieller Mobilitätsbereich"]
[null,"Kosten je Einheit\n\nBeitrag zu den Kosten des Personals, das Aufgaben durchführt, die für die Erreichung der Projektziele direkt erforderlich sind.\n\nVoraussetzung: die Antragsteller müssen Typ und Umfang der für die Durchführung der vorgeschlagenen Aktivitäten bzw. der zur Erzielung der vorgesehenen Ergebnisse benötigten Unterstützung begründen. Der Beitrag wird unter der Bedingung gewährt, dass das Gehalt für dieselbe Aufgabe nur einmal entschädigt wird.",null,null,null,null,null,null,"Kosten je Einheit je nach Entfernung und pro Teilnehmer.\n\nDie Entfernungen müssen mit dem Entfernungsrechner der Kommission ermittelt werden. \n\nDer Antragsteller muss die Entfernung der einfachen Strecke angeben, damit die Höhe der EU-Finanzhilfe für die Reise hin und zurück berechnet werden kann.",null,null,"Kosten für Aufenthalt, Unterbringung, lokale und öffentliche Transportmittel wie Bus und Taxi, persönliche oder freiwillige Krankenversicherung.\n\nKosten je Einheit je nach Dauer des Aufenthalts der Teilnehmer:\n\nPersonal: \n120 EUR/tag von 1. Tag bis zum 14\n70 EUR/tag von 15 Tag bis zum 60\n50 EUR/tag von 61 Tag bis zum 90\n\nStudent: \n55 EUR/tag von 1. Tag bis zum 14\n40 EUR/tag von 15 Tag bis zum 90",null,null,null,"Beitrag zum Erwerb der Ausrüstung, die für die Durchführung des Projekts erforderlich ist. Unterstützung wird nur für Ausrüstung gewährt, die zugunsten von Hochschuleinrichtungen in Partnerländern beschafft wird.\n\nVoraussetzung: Der Antrag auf finanzielle Förderung zur Deckung dieser Kosten muss auf dem Antragsformular begründet werden.",null,null,"Unterstützung für die Kosten im Rahmen der Vergabe von Unteraufträgen, die für die Durchführung des Projektes erforderlich ist, insbesondere Kosten für obligatorische Finanzprüfungen (Prüfbescheinigung) und externe Verfahren zur Qualitätssicherung.\n\nDie Vergabe von Unteraufträgen für Aufgaben im Rahmen des Projektmanagement ist nicht förderfähig.        \n\nDie Vergabe von Unteraufträgen an externe Organe sollte nur ausnahmsweise erfolgen. Die spezifischen Kompetenzen und insbesondere die Erfahrung, die zur Erreichung der Projektziele benötigt werden, sollten aus dem Konsortium bezogen werden und die Zusammenstellung desselben bedingen.",null,null,null,"Reisekosten: beitrag zu den Reisekosten der am Projekt beteiligten Studierenden und des Personals, von ihrem Herkunftsort zum Ort der jeweiligen Aktivität und zurück (einschließlich Visagebühren und eine diesbezügliche obligatorische Versicherung, Reiseversicherung und gerechtfertigte Stornierungskosten).\n\nDie Aktivitäten und die damit verbundenen Reise müssen in den am Projekt beteiligten Ländern durchgeführt werden. Alle Ausnahmen von dieser Regel erfordern die Genehmigung der Agentur. Eine detaillierte Liste der förderfähigen Aktivitäten ist in Anhang I dieses Leitfadens bereitgestellt.\n\n\nAufenthaltskosten: Kosten je Einheit je nach Dauer des Aufenthalts pro Teilnehmer.\nKosten für Aufenthalt, Unterbringung, lokale und öffentliche Transportmittel wie Bus und Taxi, persönliche oder freiwillige Krankenversicherung. Je nach Dauer des Aufenthalts pro Teilnehmer."]
[null,null,null,null,null,null,null,null,null,null,null,null,null,null,null,null,null,null,null,null,null,null,"Aufenthaltskosten für den speziellen Mobilitätsbereich"]
[null,"Land","PR/PA","Manager","Lehrkraft/Ausbilder/Forscher","Techniker","Verwaltungskraft",null,"Entfernung","Reisekosten\n(EUR)",null,"Anzahl von Tagen","Student","Personal",null,"100% der förderfähigen Kosten\nMax. 30% der gesamten Finanzhilfe",null,null,"100% der förderfähigen Kosten\nMax. 10% der gesamten Finanzhilfe",null,null,null,"Land","PR/PA","Student von Partnerländer","Student von Programmländer","Personal von Partnerländer","Personal von Programmländer"]
[null,{"$f":"Rates!C4","v":"Belgien"},{"$f":"Rates!D4","v":"Programmländer"},{"$f":"Rates!E4","v":280},{"$f":"Rates!F4","v":214},{"$f":"Rates!G4","v":162},{"$f":"Rates!H4","v":131},null,{"$f":"Rates!P4","v":"0 KM und 9 KM"},{"$f":"Rates!Q4","v":0},null,1,{"$f":"L8*55","v":55},{"$f":"L8*120","v":120},null,null,null,null,null,null,null,null,{"$f":"Rates!N4","v":"Belgien"},{"$f":"VLOOKUP(W8,Rates!$C$4:$L$182,2,FALSE)","v":"Programmländer"},{"$f":"VLOOKUP(W8,Rates!$C$4:$L$182,7,FALSE)","v":800},{"$f":"VLOOKUP(W8,Rates!$C$4:$L$182,8,FALSE)","v":0},{"$f":"VLOOKUP(W8,Rates!$C$4:$L$182,9,FALSE)","v":140},{"$f":"VLOOKUP(W8,Rates!$C$4:$L$182,10,FALSE)","v":0}]
[null,{"$f":"Rates!C5","v":"Bulgarien"},{"$f":"Rates!D5","v":"Programmländer"},{"$f":"Rates!E5","v":88},{"$f":"Rates!F5","v":74},{"$f":"Rates!G5","v":55},{"$f":"Rates!H5","v":39},null,{"$f":"Rates!P5","v":"10 KM und 99 KM"},{"$f":"Rates!Q5","v":20},null,2,{"$f":"L9*55","v":110},{"$f":"L9*120","v":240},null,null,null,null,null,null,null,null,{"$f":"Rates!N5","v":"Bulgarien"},{"$f":"VLOOKUP(W9,Rates!$C$4:$L$182,2,FALSE)","v":"Programmländer"},{"$f":"VLOOKUP(W9,Rates!$C$4:$L$182,7,FALSE)","v":750},{"$f":"VLOOKUP(W9,Rates!$C$4:$L$182,8,FALSE)","v":0},{"$f":"VLOOKUP(W9,Rates!$C$4:$L$182,9,FALSE)","v":140},{"$f":"VLOOKUP(W9,Rates!$C$4:$L$182,10,FALSE)","v":0}]
[null,{"$f":"Rates!C6","v":"Dänemark"},{"$f":"Rates!D6","v":"Programmländer"},{"$f":"Rates!E6","v":294},{"$f":"Rates!F6","v":241},{"$f":"Rates!G6","v":190},{"$f":"Rates!H6","v":157},null,{"$f":"Rates!P6","v":"100 KM und 499 KM"},{"$f":"Rates!Q6","v":180},null,3,165,360,null,null,null,null,null,null,null,null,{"$f":"Rates!N6","v":"Dänemark"},{"$f":"VLOOKUP(W10,Rates!$C$4:$L$182,2,FALSE)","v":"Programmländer"},{"$f":"VLOOKUP(W10,Rates!$C$4:$L$182,7,FALSE)","v":850},{"$f":"VLOOKUP(W10,Rates!$C$4:$L$182,8,FALSE)","v":0},{"$f":"VLOOKUP(W10,Rates!$C$4:$L$182,9,FALSE)","v":160},{"$f":"VLOOKUP(W10,Rates!$C$4:$L$182,10,FALSE)","v":0}]
{"$rows_left_out":176}